2017-10-05 108 views
4

我从Selenium切换到Katalon,我遇到了一些问题。 我使用詹金斯被安装在Debian操作系统: 我运行这个命令:Katalon Debian无头浏览器

./katalon --args -runMode=console -projectPath="/var/lib/jenkins/jobs/katalon_test/workspace/spot-systemtest/src/katalon/spot/katalon test.prj" \ 
-reportFolder="Reports" -reportFileName="report" \ 
-retry=0 -testSuitePath="Test Suites/WarmUp" \ 
-browserType="Headless" 

,并在执行过程中我发现了异常:

10-05-2017 06:41:34 AM - [ERROR] - Test Cases/core/login spot2 FAILED because (of) java.awt.HeadlessException: 
No X11 DISPLAY variable was set, but this program performed an operation which requires it. 

当我设置变量为 “0”,报告说:

10-05-2017 06:24:49 AM - [ERROR] - Test Cases/core/login spot2 FAILED because (of) java.awt.AWTError: Can't connect to X11 window server using ':0' as the value of the DISPLAY variable. 

没有的XServer,因为这是服务器操作系统。

我累了添加env。变量: 出口JAVA_OPTS = “ - Djava.awt.headless =真”

还我试图通过在katalon执行此参数。 不幸的是没有任何帮助。

第二件事。 我得到在这样 java.lang.NoClassDefFoundError每一步的错误:com.kms.katalon.core.webui.keyword.internal.WebUIAbstractKeyword

完整的堆栈跟踪是在这里

+ ./katalon --args -runMode=console -projectPath=/var/lib/jenkins/jobs/katalon_test/workspace/spot-systemtest/src/katalon/spot/katalon test.prj -reportFolder=Reports -reportFileName=report -retry=0 -testSuitePath=Test Suites/WarmUp -Djava.awt.headless=true -browserType=Headless 
Starting Groovy-Eclipse compiler resolver. Specified compiler level: unspecified 
122 2.4.7.xx-201611170128-e46 = ACTIVE 

-------------------------------------------------------------------------------- 
Test Suites/WarmUp - Headless - 20171005_062446..........................0/8(0%) 
-------------------------------------------------------------------------------- 

10-05-2017 06:24:48 AM - [START] - Start Test Suite : WarmUp 
10-05-2017 06:24:48 AM - [RUN_DATA] - Logging run data 'hostName' with value 'root - ee4afc86e8bd' 
10-05-2017 06:24:48 AM - [RUN_DATA] - Logging run data 'os' with value 'Linux 64bit' 
10-05-2017 06:24:48 AM - [RUN_DATA] - Logging run data 'hostAddress' with value '172.17.0.8' 
10-05-2017 06:24:48 AM - [RUN_DATA] - Logging run data 'katalonVersion' with value '4.8.0.2' 
10-05-2017 06:24:48 AM - [START] - Start Test Case : Test Cases/core/login spot2 
10-05-2017 06:24:48 AM - [INFO] - Evaluating variables for test case 
10-05-2017 06:24:48 AM - [START] - Start action : openBrowser 
10-05-2017 06:24:49 AM - [END] - End action : openBrowser 
10-05-2017 06:24:49 AM - [ERROR] - Test Cases/core/login spot2 FAILED because (of) java.awt.AWTError: Can't connect to X11 window server using ':0' as the value of the DISPLAY variable. 
10-05-2017 06:24:49 AM - [END] - End Test Case : Test Cases/core/login spot2 
10-05-2017 06:24:49 AM - [START] - Start Test Case : Test Cases/core/open_module_DASHBOARD 
10-05-2017 06:24:49 AM - [INFO] - Evaluating variables for test case 
10-05-2017 06:24:49 AM - [START] - Start action : click 
10-05-2017 06:24:49 AM - [INFO] - Finding Test Object with id 'Object Repository/core/open_module' 
10-05-2017 06:24:49 AM - [END] - End action : click 
10-05-2017 06:24:49 AM - [ERROR] - Test Cases/core/open_module_DASHBOARD FAILED because (of) java.lang.NoClassDefFoundError: com.kms.katalon.core.webui.keyword.internal.WebUIAbstractKeyword 
10-05-2017 06:24:49 AM - [END] - End Test Case : Test Cases/core/open_module_DASHBOARD 
10-05-2017 06:24:49 AM - [START] - Start Test Case : Test Cases/core/open_module_ADDRESS_BOOK 
10-05-2017 06:24:49 AM - [INFO] - Evaluating variables for test case 
10-05-2017 06:24:49 AM - [START] - Start action : click 
10-05-2017 06:24:49 AM - [INFO] - Finding Test Object with id 'Object Repository/core/open_module' 
10-05-2017 06:24:49 AM - [END] - End action : click 
10-05-2017 06:24:49 AM - [ERROR] - Test Cases/core/open_module_ADDRESS_BOOK FAILED because (of) java.lang.NoClassDefFoundError: com.kms.katalon.core.webui.keyword.internal.WebUIAbstractKeyword 
10-05-2017 06:24:49 AM - [END] - End Test Case : Test Cases/core/open_module_ADDRESS_BOOK 
10-05-2017 06:24:49 AM - [START] - Start Test Case : Test Cases/core/open_module_TRACKING 
10-05-2017 06:24:49 AM - [INFO] - Evaluating variables for test case 
10-05-2017 06:24:49 AM - [START] - Start action : click 
10-05-2017 06:24:49 AM - [INFO] - Finding Test Object with id 'Object Repository/core/open_module' 
10-05-2017 06:24:49 AM - [END] - End action : click 
10-05-2017 06:24:49 AM - [ERROR] - Test Cases/core/open_module_TRACKING FAILED because (of) java.lang.NoClassDefFoundError: com.kms.katalon.core.webui.keyword.internal.WebUIAbstractKeyword 
10-05-2017 06:24:49 AM - [END] - End Test Case : Test Cases/core/open_module_TRACKING 
10-05-2017 06:24:49 AM - [START] - Start Test Case : Test Cases/core/open_module_TRANSPORT_ORDER 
10-05-2017 06:24:49 AM - [INFO] - Evaluating variables for test case 
10-05-2017 06:24:49 AM - [START] - Start action : click 
10-05-2017 06:24:49 AM - [INFO] - Finding Test Object with id 'Object Repository/core/open_module' 
10-05-2017 06:24:49 AM - [END] - End action : click 
10-05-2017 06:24:49 AM - [ERROR] - Test Cases/core/open_module_TRANSPORT_ORDER FAILED because (of) java.lang.NoClassDefFoundError: com.kms.katalon.core.webui.keyword.internal.WebUIAbstractKeyword 
10-05-2017 06:24:49 AM - [END] - End Test Case : Test Cases/core/open_module_TRANSPORT_ORDER 
10-05-2017 06:24:49 AM - [START] - Start Test Case : Test Cases/core/open_module_REPORT 
10-05-2017 06:24:50 AM - [INFO] - Evaluating variables for test case 
10-05-2017 06:24:50 AM - [START] - Start action : click 
10-05-2017 06:24:50 AM - [INFO] - Finding Test Object with id 'Object Repository/core/open_module' 
10-05-2017 06:24:50 AM - [END] - End action : click 
10-05-2017 06:24:50 AM - [ERROR] - Test Cases/core/open_module_REPORT FAILED because (of) java.lang.NoClassDefFoundError: com.kms.katalon.core.webui.keyword.internal.WebUIAbstractKeyword 
10-05-2017 06:24:50 AM - [END] - End Test Case : Test Cases/core/open_module_REPORT 
10-05-2017 06:24:50 AM - [START] - Start Test Case : Test Cases/core/open_module_PURCHASE_ORDER 
10-05-2017 06:24:50 AM - [INFO] - Evaluating variables for test case 
10-05-2017 06:24:50 AM - [START] - Start action : click 
10-05-2017 06:24:50 AM - [INFO] - Finding Test Object with id 'Object Repository/core/open_module' 
10-05-2017 06:24:50 AM - [END] - End action : click 
10-05-2017 06:24:50 AM - [ERROR] - Test Cases/core/open_module_PURCHASE_ORDER FAILED because (of) java.lang.NoClassDefFoundError: com.kms.katalon.core.webui.keyword.internal.WebUIAbstractKeyword 
10-05-2017 06:24:50 AM - [END] - End Test Case : Test Cases/core/open_module_PURCHASE_ORDER 
10-05-2017 06:24:50 AM - [START] - Start Test Case : Test Cases/core/logout_spot2 
10-05-2017 06:24:50 AM - [INFO] - Evaluating variables for test case 
10-05-2017 06:24:50 AM - [START] - Start action : click 
10-05-2017 06:24:50 AM - [INFO] - Finding Test Object with id 'Object Repository/core/top_bar/top_bar_menu_by_icon' 
10-05-2017 06:24:50 AM - [END] - End action : click 
10-05-2017 06:24:50 AM - [ERROR] - Test Cases/core/logout_spot2 FAILED because (of) java.lang.NoClassDefFoundError: com.kms.katalon.core.webui.keyword.internal.WebUIAbstractKeyword 
10-05-2017 06:24:50 AM - [END] - End Test Case : Test Cases/core/logout_spot2 
10-05-2017 06:24:50 AM - [END] - End Test Suite : WarmUp 
Copying report to folder /var/lib/jenkins/jobs/katalon_test/workspace/spot-systemtest/src/katalon/spot/Reports... 

-------------------------------------------------------------------------------- 
Test Suites/WarmUp - Headless - 20171005_062446........................8/8(100%) 
-------------------------------------------------------------------------------- 

回答

1

我想你还需要为Jenkins增加额外的配置。

  1. 安装这个插件:https://wiki.jenkins.io/display/JENKINS/Xvfb+Plugin
  2. 你已经安装了它之后,在 '其他设置' 这个插件的领域使用此设置:

    出口显示器=:1.0

对于您的其他问题,您可以发布完整的测试用例脚本吗?